FAILURE: Build completed with 2 failures. 1: Task...
# flutter
c
FAILURE: Build completed with 2 failures. 1: Task failed with an exception. ----------- * What went wrong: Execution failed for task 'appcompileFlutterBuildDebug'.
Process 'command '/Users/piqotech/Documents/stableflutter/flutter/bin/flutter'' finished with non-zero exit value 1
* Try:
Run with --stacktrace option to get the stack trace.
Run with --info or --debug option to get more log output.
Run with --scan to get full insights.
============================================================================== 2: Task failed with an exception. ----------- * What went wrong: Execution failed for task 'file pickercompileDebugJavaWithJavac'.
Compilation failed; see the compiler error output for details.
* Try:
Run with --stacktrace option to get the stack trace.
Run with --info or --debug option to get more log output.
Run with --scan to get full insights.
============================================================================== * Get more help at https://help.gradle.org BUILD FAILED in 23s 730