Akhil Varghese
11/11/2024, 10:11 AMFAILURE: Build failed with an exception.
* What went wrong:
Execution failed for task ':webview_flutter_android:compileDebugJavaWithJavac'.
> Could not resolve all files for configuration ':webview_flutter_android:androidJdkImage'.
> Failed to transform core-for-system-modules.jar to match attributes {artifactType=_internal_android_jdk_image, org.gradle.libraryelements=jar, org.gradle.usage=java-runtime}.
> Execution failed for JdkImageTransform: C:\Users\akhil\AppData\Local\Android\sdk\platforms\android-34\core-for-system-modules.jar.
> Error while executing process C:\Program Files\Android\Android Studio\jbr\bin\jlink.exe with arguments {--module-path C:\Users\akhil\.gradle\caches\transforms-3\4a46fc89ed5f9adfe3afebf74eb8bfeb\transformed\output\temp\jmod --add-modules java.base --output C:\Users\akhil\.gradle\caches\transforms-3\4a46fc89ed5f9adfe3afebf74eb8bfeb\transformed\output\jdkImage --disable-plugin system-modules}
* Try:
> Run with --stacktrace option to get the stack trace.
> Run with --info or --debug option to get more log output.
> Run with --scan to get full insights.
> Get more help at <https://help.gradle.org>.
BUILD FAILED in 6s
Running Gradle task 'assembleDebug'... 7.5s
Error: Gradle task assembleDebug failed with exit code 1
Could someone help me with this?Mani Ratan
11/13/2024, 7:35 AMCould not resolve all files for configuration 'shared preferences androidandroidJdkImage'.> Failed to transform core-for-system-modules.jar to match attributes {artifactType=_internal_android_jdk_image, org.gradle.libraryelements=jar, org.gradle.usage=java-runtime}. > Execution failed for JdkImageTransform: C:\Users\shaik\AppData\Local\Android\sdk\platforms\android-34\core-for-system-modules.jar. > Error while executing process C:\Program Files\Android\Android Studio\jbr\bin\jlink.exe with arguments {--module-path C:\Users\shaik\.gradle\caches\transforms-3\4a46fc89ed5f9adfe3afebf74eb8bfeb\transformed\output\temp\jmod --add-modules java.base --output C:\Users\shaik\.gradle\caches\transforms-3\4a46fc89ed5f9adfe3afebf74eb8bfeb\transformed\output\jdkImage --disable-plugin system-modules} * Try:
Run with --stacktrace option to get the stack trace.
Run with --info or --debug option to get more log output.
Run with --scan to get full insights.
Get more help at https://help.gradle.org.BUILD FAILED in 6s Error: Gradle task assembleDebug failed with exit code 1
Akhil Varghese
11/13/2024, 11:44 AMflutter_super_html_viewer: ^0.1.0, and it works with my requirements.Mani Ratan
11/14/2024, 5:21 AMAkhil Varghese
11/15/2024, 6:58 AM