Please help below issue FAILURE: Build failed with...
# flutter
p
Please help below issue FAILURE: Build failed with an exception. * What went wrong: Execution failed for task 'android intent pluscompileDebugJavaWithJavac'.
error: invalid source release: 17
* Try:
Run with --stacktrace option to get the stack trace.
Run with --info or --debug option to get more log output.
Run with --scan to get full insights.
* Get more help at https://help.gradle.org BUILD FAILED in 10s Running Gradle task 'assembleDebug'... 12.5s Exception: Gradle task assembleDebug failed with exit code 1