Launching lib\main.dart on SM A507FN in debug mode...
# flutter
w
Launching lib\main.dart on SM A507FN in debug mode... Running Gradle task 'assembleDebug'... FAILURE: Build failed with an exception. * Where: Build file 'C:\Users\anshc\Downloads\Zoel\tabs\android\app\build.gradle' line: 60 * What went wrong: A problem occurred evaluating project ':app'.
path may not be null or empty string. path='null'
* Try: Run with --stacktrace option to get the stack trace. Run with --info or --debug option to get more log output. Run with --scan to get full insights. * Get more help at https://help.gradle.org BUILD FAILED in 1s Exception: Gradle task assembleDebug failed with exit code 1