FAILURE: Build failed with an exception. * What w...
# flutter
a
FAILURE: Build failed with an exception. * What went wrong: Execution failed for task 'background fetchverifyReleaseResources'.
A failure occurred while executing com.android.build.gradle.tasks.VerifyLibraryResourcesTask$Action
> Android resource linking failed ERRORC\Users\subas\flutter_projects\StablePayMobile\near_pay_app\build\background_fetch\intermediates\merged_res\release\values\values.xml2520 AAPT: error: resource android:attr/lStar not found. * Try:
Run with --stacktrace option to get the stack trace.
Run with --info or --debug option to get more log output.
Run with --scan to get full insights.
* Get more help at https://help.gradle.org BU�LD FAILED in 22s Running Gradle task 'assembleRelease'... 23,2s Gradle task assembleRelease failed with exit code 1 ""how can I fix this""