FAILURE: Build failed with an exception. * Where:...
# community-support
n
FAILURE: Build failed with an exception. * Where: Build file 'C:\react_native\hulkbuster\android\app\build.gradle' line: 1 * What went wrong: A problem occurred evaluating project ':app'.
Failed to apply plugin 'com.android.internal.application'.
> Android Gradle plugin requires Java 17 to run. You are currently using Java 11. Your current JDK is located in C:\Users\arunn\AppData\Local\jdk-11.0.2 You can try some of the following options: - changing the IDE settings. - changing the JAVA_HOME environment variable. - changing
org.gradle.java.home
in
gradle.properties
. * Try:
Run with --stacktrace option to get the stack trace.
Run with --info or --debug option to get more log output.
Run with --scan to get full insights.
Get more help at https://help.gradle.org.
BUILD FAILED in 44s info Run CLI with --verbose flag for more details. info Stopping server