yandre@MuhammadDavid:~/my_app$ flutter run
Launching lib/main.dart on Android SDK built for x86 in debug mode...
startup failed:
/home/yandre/snap/flutter/common/flutter/packages/flutter_tools/gradle/build/classes/groovy/main/FlutterPlugin$_addTasksForOutputsAppLinkSettings_closure22$_closure48$_closure50$_closure51$_closure52$_closure53$_closure55$_closure57$_closure58.class (File name too long)
1 error
FAILURE: Build failed with an exception.
* What went wrong:
Execution failed for task 'GcompileGroovy'.
Compilation failed; see the compiler error output for details.
* Try:
Run with --stacktrace option to get the stack trace.
Run with --info or --debug option to get more log output.
Run with --scan to get full insights.
* Get more help at
https://help.gradle.org
BUILD FAILED in 21s
Running Gradle task 'assembleDebug'... 22.5s
Exception: Gradle task assembleDebug failed with exit code 1
yandre@MuhammadDavid:~/my_app$
why ?? help me pleace