Target kernel_snapshot failed: ProcessException: O...
# community-support
a
Target kernel_snapshot failed: ProcessException: Operation did not complete successfully because the file contains a virus or potentially unwanted software. Command: C:\src\flutter\bin\cache\dart-sdk\bin\dart.exe --disable-dart-dev C:\src\flutter\bin\cache\dart-sdk\bin\snapshots\frontend_server.dart.snapshot --sdk-root C:\src\flutter\bin\cache\artifacts\engine\common\flutter_patched_sdk/ --target=flutter --no-print-incremental-dependencies -DFLUTTER_WEB_AUTO_DETECT=true -DFLUTTER_WEB_CANVASKIT_URL=https://www.gstatic.com/flutter-canvaskit/0545f8705df301877d787107bac1a6e9fc9ee1ad/ -Ddart.vm.profile=false -Ddart.vm.product=false --enable-asserts --track-widget-creation --no-link-platform --packages D:\Flutter\Projects\learn_app_after_update\.dart_tool\package_config.json --output-dill D:\Flutter\Projects\learn_app_after_update\.dart_tool\flutter_build\4f44e8e60ee27d202894a8bc0ed58f20\app.dill --depfile D:\Flutter\Projects\learn_app_after_update\.dart_tool\flutter_build\4f44e8e60ee27d202894a8bc0ed58f20\kernel_snapshot.d --incremental --initialize-from-dill D:\Flutter\Projects\learn_app_after_update\.dart_tool\flutter_build\4f44e8e60ee27d202894a8bc0ed58f20\app.dill --source file///D/Flutter/Projects/learn_app_after_update/.dart_tool/flutter_build/dart_plugin_registrant.dart --source package:flutter/src/dart_plugin_registrant.dart -Dflutter.dart_plugin_registrant=file///D/Flutter/Projects/learn_app_after_update/.dart_tool/flutter_build/dart_plugin_registrant.dart --verbosity=error package:learn_app_after_update/main.dart 3 FAILURE: Build failed with an exception. * What went wrong: Execution failed for task 'appcompileFlutterBuildDebug'.
Process 'command 'C:\src\flutter\bin\flutter.bat'' finished with non-zero exit value 1
* Try:
Run with --stacktrace option to get the stack trace.
Run with --info or --debug option to get more log output.
Run with --scan to get full insights.
* Get more help at https://help.gradle.org BUILD FAILED in 5s Exception: Gradle task assembleDebug failed with exit code 1 Exited (sigterm)