Jonathan Nuñez
07/13/2023, 7:14 PMhi, i'm facing some strage behaviour: when i create a new fresh flutter project everything works. but i need to add Firebase SDK and everything goes crazy as soon i do $ flutterfire configure and try to run the code Running Gradle task 'assembleDebug'...
FAILURE: Build failed with an exception.
* What went wrong:
Execution failed for task ':app:mapDebugSourceSetPaths'.
> Error while evaluating property 'extraGeneratedResDir' of task ':app:mapDebugSourceSetPaths'
> Failed to calculate the value of task ':app:mapDebugSourceSetPaths' property 'extraGeneratedResDir'.
> Querying the mapped value of provider(java.util.Set) before task ':app:processDebugGoogleServices' has completed is not supported
* Try:
> Run with --stacktrace option to get the stack trace.
> Run with --info or --debug option to get more log output.
> Run with --scan to get full insights.
* Get more help at <https://help.gradle.org>
BUILD FAILED in 1s
Exception: Gradle task assembleDebug failed with exit code 1 i'm using Flutter 3.10.5, dart 3.0.5