when try to run my flutter project in android devi...
# flutter
s
when try to run my flutter project in android devices it's show this type error how can i solve that? FAILURE: Build failed with an exception. * Where: Build file 'D:\ftapp\inventory_management\android\app\build.gradle' line: 28 * What went wrong: A problem occurred evaluating project ':app'.
No signature of method: build_abugwfhb048cqlboh1514xwr7.android() is applicable for argument types: (build_abugwfhb048cqlboh1514xwr7$_run_closure2) values: [build_abugwfhb048cqlboh1514xwr7$_run_closure2@40c05412]
* Try:
Run with --stacktrace option to get the stack trace.
Run with --info or --debug option to get more log output.
Run with --scan to get full insights.
* Get more help at https://help.gradle.org BUILD FAILED in 22s Exception: Gradle task assembleDebug failed with exit code 1 Exited (sigterm)