FAILURE: Build failed with an exception. * What w...
# flutter
u
FAILURE: Build failed with an exception. * What went wrong: Could not open settings generic class cache for settings file '/Applications/workspace/col/flutter_unionad/example/android/settings.gradle' (/Users/boyingbing/.gradle/caches/6.5/scripts/3n8ygcxrc7nelqcw5tzib8bo6/settings6418c6d726070f323dbddda2aadc82ef).
BUG! exception in phase 'semantic analysis' in source unit '_BuildScript_' Unsupported class file major version 61
* Try: Run with --stacktrace option to get the stack trace. Run with --info or --debug option to get more log output. Run with --scan to get full insights. * Get more help at https://help.gradle.org BUILD FAILED in 670ms Exception: Gradle task assembleDebug failed with exit code 1