/ FAILURE: Build failed with an exception. * Wher...
# flutter
m
/ FAILURE: Build failed with an exception. * Where: Script 'C:\src\flutter\packages\flutter_tools\gradle\flutter.gradle' line: 1151 * What went wrong:
Process 'command 'C:\src\flutter\bin\flutter.bat'' finished with non-zero exit value 1
* Try:
Run with --stacktrace option to get the stack trace.
Run with --info or --debug option to get more log output.
Run with --scan to get full insights.
* Get more help at https://help.gradle.org BUILD FAILED in 26s
👀 1