#C03EM93810S /C
/Users/Multichoiceagency/AppData/Local/Pub/Cache/hosted/pub.dev/firebase core 1.24.0/lib/src/firebase app.dart18
25 Error: Member not found: 'FirebaseAppPlatform.verifyExtends'.
FirebaseAppPlatform.verifyExtends(_delegate);
^^^^^^^^^^^^^
Target kernel_snapshot failed: Exception
FAILURE: Build failed with an exception.
* Where:
Script 'C:\src\flutter\packages\flutter_tools\gradle\flutter.gradle' line: 1157
* What went wrong:
Execution failed for task '
appcompileFlutterBuildDebug'.
Process 'command 'C:\src\flutter\bin\flutter.bat'' finished with non-zero exit value 1
* Try:
Run with --stacktrace option to get the stack trace.
Run with --info or --debug option to get more log output.
Run with --scan to get full insights.
* Get more help at
https://help.gradle.org
BUILD FAILED in 41s
Exception: Gradle task assembleDebug failed with exit code 1