FAILURE: Build failed with an exception. * What w...
# flutter
a
FAILURE: Build failed with an exception. * What went wrong: Execution failed for task 'appcheckDebugDuplicateClasses'.
A failure occurred while executing com.android.build.gradle.internal.tasks.CheckDuplicatesRunnable
> Duplicate class com.google.common.util.concurrent.ListenableFuture found in modules jetified-guava-20.0 (com.google.guavaguava20.0) and jetified-listenablefuture-1.0 (com.google.guavalistenablefuture1.0) Go to the documentation to learn how to <a href="d.android.com/r/tools/classpath-sync-errors">Fix dependency resolution errors</a>. * Try: Run with --stacktrace option to get the stack trace. Run with --info or --debug option to get more log output. Run with --scan to get full insights. * Get more help at https://help.gradle.org BUILD FAILED in 29s Exception: Gradle task assembleDebug failed with exit code 1