Mahdi Bagheri
04/29/2023, 12:14 PMFAILURE: Build failed with an exception.
* What went wrong:
Execution failed for task ':app:checkDebugAarMetadata'.
> Could not resolve all files for configuration ':app:debugRuntimeClasspath'.
> Failed to transform exoplayer-hls-2.18.5.aar (com.google.android.exoplayer:exoplayer-hls:2.18.5) to match attributes {artifactType=android-aar-metadata, org.gradle.category=library, org.gradle.dependency.bundling=external, org.gradle.libraryelements=aar, org.gradle.status=release, org.gradle.usage=java-runtime}.
> Could not find exoplayer-hls-2.18.5.aar (com.google.android.exoplayer:exoplayer-hls:2.18.5).
Searched in the following locations:
<https://dl.google.com/dl/android/maven2/com/google/android/exoplayer/exoplayer-hls/2.18.5/exoplayer-hls-2.18.5.aar>
> Failed to transform media2-session-1.2.0.aar (androidx.media2:media2-session:1.2.0) to match attributes {artifactType=android-aar-metadata, org.gradle.category=library, org.gradle.dependency.bundling=external, org.gradle.libraryelements=aar, org.gradle.status=release, org.gradle.usage=java-runtime}.
> Could not find media2-session-1.2.0.aar (androidx.media2:media2-session:1.2.0).
Searched in the following locations:
<https://dl.google.com/dl/android/maven2/androidx/media2/media2-session/1.2.0/media2-session-1.2.0.aar>
> Failed to transform media2-common-1.2.0.aar (androidx.media2:media2-common:1.2.0) to match attributes {artifactType=android-aar-metadata, org.gradle.category=library, org.gradle.dependency.bundling=external, org.gradle.libraryelements=aar, org.gradle.status=release, org.gradle.usage=java-runtime}.
> Could not find media2-common-1.2.0.aar (androidx.media2:media2-common:1.2.0).
Searched in the following locations:
<https://dl.google.com/dl/android/maven2/androidx/media2/media2-common/1.2.0/media2-common-1.2.0.aar>
> Failed to transform exifinterface-1.3.6.aar (androidx.exifinterface:exifinterface:1.3.6) to match attributes {artifactType=android-aar-metadata, org.gradle.category=library, org.gradle.dependency.bundling=external, org.gradle.libraryelements=aar, org.gradle.status=release, org.gradle.usage=java-runtime}.
> Could not find exifinterface-1.3.6.aar (androidx.exifinterface:exifinterface:1.3.6).
Searched in the following locations:
<https://dl.google.com/dl/android/maven2/androidx/exifinterface/exifinterface/1.3.6/exifinterface-1.3.6.aar>
* Try:
> Run with --stacktrace option to get the stack trace.
> Run with --info or --debug option to get more log output.
> Run with --scan to get full insights.
* Get more help at <https://help.gradle.org>
BUILD FAILED in 33s
Exception: Gradle task assembleDebug failed with exit code 1