best-umbrella-88325
02/06/2023, 10:44 AMbest-umbrella-88325
02/06/2023, 10:45 AM-----------------------------------------------------------------------------------------------------------------------
TOTAL 33591 12031 64%
========================================================================================================= short test summary info ==========================================================================================================
FAILED tests/unit/test_pipeline.py::TestPipeline::test_configure_without_sink - AssertionError: assert {'server': 'h...RE-uPOh9GoV4'} == {'server': 'h...'token': None}
FAILED tests/integration/kafka-connect/test_kafka_connect.py::test_kafka_connect_ingest - Exception: Command docker-compose -f "/mnt/c/XXX/XXX/open-datahub/datahub/metadata-ingestion/tests/integration/kafka/docker-compose.yml" -f "/mnt/c/XXX/XXX/open-datahub/datahub/metadata-ingestion/tests/integration/kaf...
FAILED tests/integration/kafka-connect/test_kafka_connect.py::test_kafka_connect_mongosourceconnect_ingest - Exception: Command docker-compose -f "/mnt/c/XXX/XXX/open-datahub/datahub/metadata-ingestion/tests/integration/kafka/docker-compose.yml" -f "/mnt/c/XXX/XXX/open-datahub/datahub/metadata-ingestion/tests/integration/kaf...
FAILED tests/integration/ldap/test_ldap_stateful.py::test_ldap_stateful - Exception: Command docker-compose -f "/mnt/c/XXX/XXX/open-datahub/datahub/metadata-ingestion/tests/integration/ldap/docker-compose.yml" -p "pytest287-ldap" up --build -d returned 1: """openldap Pulling
FAILED tests/integration/s3/test_s3.py::test_data_lake_s3_ingest[file_without_extension.json] - AssertionError: MCEs differ
FAILED tests/integration/s3/test_s3.py::test_data_lake_s3_ingest[multiple_files.json] - AssertionError: MCEs differ
FAILED tests/integration/s3/test_s3.py::test_data_lake_local_ingest[file_without_extension.json] - datahub.ingestion.run.pipeline.PipelineInitError: Failed to configure the source (s3): [Errno 2] No such file or directory
FAILED tests/integration/s3/test_s3.py::test_data_lake_local_ingest[folder_no_partition.json] - datahub.ingestion.run.pipeline.PipelineInitError: Failed to configure the source (s3): [Errno 2] No such file or directory
FAILED tests/integration/s3/test_s3.py::test_data_lake_local_ingest[folder_no_partition_exclude.json] - datahub.ingestion.run.pipeline.PipelineInitError: Failed to configure the source (s3): [Errno 2] No such file or directory
FAILED tests/integration/s3/test_s3.py::test_data_lake_local_ingest[folder_no_partition_filename.json] - datahub.ingestion.run.pipeline.PipelineInitError: Failed to configure the source (s3): [Errno 2] No such file or directory
FAILED tests/integration/s3/test_s3.py::test_data_lake_local_ingest[folder_no_partition_glob.json] - datahub.ingestion.run.pipeline.PipelineInitError: Failed to configure the source (s3): [Errno 2] No such file or directory
FAILED tests/integration/s3/test_s3.py::test_data_lake_local_ingest[folder_partition_basic.json] - datahub.ingestion.run.pipeline.PipelineInitError: Failed to configure the source (s3): [Errno 2] No such file or directory
FAILED tests/integration/s3/test_s3.py::test_data_lake_local_ingest[folder_partition_keyval.json] - datahub.ingestion.run.pipeline.PipelineInitError: Failed to configure the source (s3): [Errno 2] No such file or directory
FAILED tests/integration/s3/test_s3.py::test_data_lake_local_ingest[multiple_files.json] - datahub.ingestion.run.pipeline.PipelineInitError: Failed to configure the source (s3): [Errno 2] No such file or directory
FAILED tests/integration/s3/test_s3.py::test_data_lake_local_ingest[multiple_spec_for_files.json] - datahub.ingestion.run.pipeline.PipelineInitError: Failed to configure the source (s3): [Errno 2] No such file or directory
FAILED tests/integration/s3/test_s3.py::test_data_lake_local_ingest[single_file.json] - datahub.ingestion.run.pipeline.PipelineInitError: Failed to configure the source (s3): [Errno 2] No such file or directory
FAILED tests/integration/snowflake/test_snowflake.py::test_snowflake_basic - AssertionError: MCEs differ
ERROR tests/integration/presto-on-hive/test_presto_on_hive.py::test_presto_on_hive_ingest[hive-False-False-False-_1] - Exception: Command docker-compose -f "/mnt/c/XXX/XXX/open-datahub/datahub/metadata-ingestion/tests/integration/presto-on-hive/docker-compose.yml" -p "pytest287-presto-on-hive" up --build -d returned 1: """presto-cli Pulling
ERROR tests/integration/presto-on-hive/test_presto_on_hive.py::test_presto_on_hive_ingest[presto-on-hive-True-True-False-_2] - Exception: Command docker-compose -f "/mnt/c/XXX/XXX/open-datahub/datahub/metadata-ingestion/tests/integration/presto-on-hive/docker-compose.yml" -p "pytest287-presto-on-hive" up --build -d returned 1: """presto-cli Pulling
ERROR tests/integration/presto-on-hive/test_presto_on_hive.py::test_presto_on_hive_ingest[hive-False-False-True-_3] - Exception: Command docker-compose -f "/mnt/c/XXX/XXX/open-datahub/datahub/metadata-ingestion/tests/integration/presto-on-hive/docker-compose.yml" -p "pytest287-presto-on-hive" up --build -d returned 1: """presto-cli Pulling
ERROR tests/integration/presto-on-hive/test_presto_on_hive.py::test_presto_on_hive_ingest[presto-on-hive-True-True-True-_4] - Exception: Command docker-compose -f "/mnt/c/XXX/XXX/open-datahub/datahub/metadata-ingestion/tests/integration/presto-on-hive/docker-compose.yml" -p "pytest287-presto-on-hive" up --build -d returned 1: """presto-cli Pulling
ERROR tests/integration/presto-on-hive/test_presto_on_hive.py::test_presto_on_hive_instance_ingest - Exception: Command docker-compose -f "/mnt/c/XXX/XXX/open-datahub/datahub/metadata-ingestion/tests/integration/presto-on-hive/docker-compose.yml" -p "pytest287-presto-on-hive" up --build -d returned 1: """presto-cli Pulling
======================================================================= 17 failed, 754 passed, 1 skipped, 47 deselected, 68 warnings, 5 errors in 1093.11s (0:18:13) =======================================================================
--- Logging error ---
Traceback (most recent call last):
File "/usr/lib/python3.9/logging/__init__.py", line 1082, in emit
stream.write(msg + self.terminator)
ValueError: I/O operation on closed file.
Call stack:
File "/mnt/c/XXX/XXX/open-datahub/datahub/metadata-ingestion/venv/lib/python3.9/site-packages/airflow/settings.py", line 407, in dispose_ormgentle-hamburger-31302
02/07/2023, 12:11 PMbest-umbrella-88325
02/07/2023, 12:11 PMgentle-hamburger-31302
02/07/2023, 12:12 PMbest-umbrella-88325
02/07/2023, 12:12 PMbest-umbrella-88325
02/07/2023, 12:14 PMgentle-hamburger-31302
02/07/2023, 12:14 PMgentle-hamburger-31302
02/07/2023, 12:14 PMbest-umbrella-88325
02/07/2023, 12:14 PMbetter-orange-49102
02/07/2023, 12:20 PMgentle-hamburger-31302
02/07/2023, 12:31 PMAssertionError: MCEs differ then you can run the pytest as pytest tests/integration/s3 --update-golden-files and verify that updated golden file is as per your expectation, thereafter you can commit golden file and open the PRgentle-hamburger-31302
02/07/2023, 12:31 PMbest-umbrella-88325
02/07/2023, 12:41 PMbest-umbrella-88325
02/08/2023, 10:33 AMgentle-hamburger-31302
02/08/2023, 10:39 AMbest-umbrella-88325
02/08/2023, 10:40 AM