```> Task :datahub-web-react:yarnBuild FAILED ...
# troubleshoot
b
Copy code
> Task :datahub-web-react:yarnBuild FAILED

FAILURE: Build failed with an exception.

* What went wrong:
Execution failed for task ':datahub-web-react:yarnBuild'.
> Process 'command 'yarn'' finished with non-zero exit value 1
b
Can you share the exception from the log? This would be earlier in the log. You can also run the following to narrow scope of the logs like so by re-running just the failed task
./gradlew :datahub-web-react:yarnBuild