<@U02FT8KNUUS> <@U01JUBAPZPS> i tried the above fi...
# all-things-deployment
s
@some-glass-26087 @green-football-43791 i tried the above fix it started to process now but now its failing with below error ..
> Task :datahub-web-react:yarnInstall
info Visit <https://yarnpkg.com/en/docs/cli/install> for documentation about this command.
error /datahub-src/datahub-web-react/node_modules/cypress: Command failed.
Exit code: 1
Command: node index.js --exec install
Arguments:
Directory: /datahub-src/datahub-web-react/node_modules/cypress
Output:
Installing Cypress (version: 7.3.0)
[12:21:54]  Downloading Cypress     [started]
[12:25:19]  Downloading Cypress     [failed]
The Cypress App could not be downloaded.
Does your workplace require a proxy to be used to access the Internet? If so, you must configure the HTTP_PROXY environment variable before downloading Cypress. Read more: <https://on.cypress.io/proxy-configuration>
Otherwise, please check network connectivity and try again:
----------
URL: <https://download.cypress.io/desktop/7.3.0?platform=linux&arch=x64>
Error: read ECONNRESET
----------
Platform: linux (Alpine Linux - 3.14.2)
Cypress Version: 7.3.0
> Task :datahub-web-react:yarnInstall FAILED
Note: Some input files use or override a deprecated API.
Note: Recompile with -Xlint:deprecation for details.
Note: Some input files use unchecked or unsafe operations.
> Task :gms:impl:compileJava
Note: Recompile with -Xlint:unchecked for details.
FAILURE: Build failed with an exception.
* What went wrong:
Execution failed for task ':datahub-web-react:yarnInstall'.
> Process 'command '/datahub-src/datahub-web-react/.gradle/yarn/yarn-v1.22.0/bin/yarn'' finished with non-zero exit value 1
* Try:
Run with --stacktrace option to get the stack trace. Run with --info or --debug option to get more log output. Run with --scan to get full insights.
* Get more help at <https://help.gradle.org>
Deprecated Gradle features were used in this build, making it incompatible with Gradle 6.0.
Use '--warning-mode all' to show the individual deprecation warnings.
See <https://docs.gradle.org/5.6.4/userguide/command_line_interface.html#sec:command_line_warnings>
BUILD FAILED in 13m 20s
82 actionable tasks: 82 executed
The command '/bin/sh -c cd datahub-src && ./gradlew :datahub-frontend:dist -PenableEmber=${ENABLE_EMBER} -x test -x yarnTest -x yarnLint     && cp datahub-frontend/build/distributions/datahub-frontend.zip ../datahub-frontend.zip     && cd .. && rm -rf datahub-src && unzip datahub-frontend.zip' returned a non-zero code: 1