Ari Huttunen
02/22/2023, 10:39 AM[INFO] ------------------------------------------------------------------------
[INFO] BUILD FAILURE
[INFO] ------------------------------------------------------------------------
[INFO] Total time: 01:18 min
[INFO] Finished at: 2023-02-22T12:27:41+02:00
[INFO] ------------------------------------------------------------------------
[ERROR] Failed to execute goal net.alchim31.maven:scala-maven-plugin:3.2.2:compile (scala-compile-first) on project flink-table-api-scala-bridge_2.12: wrap: org.apache.commons.exec.ExecuteException: Process exited with an error: 240 (Exit value: 240) -> [Help 1]
[ERROR]
[ERROR] To see the full stack trace of the errors, re-run Maven with the -e switch.
[ERROR] Re-run Maven using the -X switch to enable full debug logging.
[ERROR]
[ERROR] For more information about the errors and possible solutions, please read the following articles:
[ERROR] [Help 1] <http://cwiki.apache.org/confluence/display/MAVEN/MojoExecutionException>
[ERROR]
[ERROR] After correcting the problems, you can resume the build with the command
[ERROR] mvn <args> -rf :flink-table-api-scala-bridge_2.12