Ameya Bapat
07/04/2023, 12:03 PME requests.exceptions.ReadTimeout: UnixHTTPConnectionPool(host='localhost', port=None): Read timed out. (read timeout=60)
.venv/lib/python3.9/site-packages/requests/adapters.py:578: ReadTimeout
test_utils.py::test_not_found_container ??? 98% ??????????????????????????????
test_utils.py::TestLoadYamlOrJsonPath.test_load_json ??? 98% ??????????????????????????????
test_utils.py::TestLoadYamlOrJsonPath.test_load_yaml ??? 99% ??????????????????????????????
test_utils.py::TestLoadYamlOrJsonPath.test_load_other ??? 99% ??????????????????????????????
test_utils.py::test_find_all_values_for_key_in_schema[schema0-looking_for_this_key-expected_values0] ???99% ??????????????????????????????
test_utils.py::test_find_all_values_for_key_in_schema[schema1-looking_for_this_key-expected_values1] ???99% ??????????????????????????????
test_utils.py::test_find_all_values_for_key_in_schema[schema2-looking_for_this_key-expected_values2] ???99% ??????????????????????????????
test_utils.py::test_build_configured_catalog_from_discovered_catalog_and_empty_streams[discovered_catalog0-empty_streams0] ???99% ??????????????????????????????
test_utils.py::test_build_configured_catalog_from_discovered_catalog_and_empty_streams[discovered_catalog1-empty_streams1] ???99% ??????????????????????????????
test_utils.py::test_build_configured_catalog_from_custom_catalog[custom_configured_catalog0-False] ???99% ??????????????????????????????
test_utils.py::test_build_configured_catalog_from_custom_catalog[custom_configured_catalog1-True] ???100% ??????????????????????????????=============================== warnings summary ===============================
test_config.py::TestConfig::test_config_parsing[Legacy config should be parsed without error.]
test_config.py::TestConfig::test_legacy_config_migration[A legacy raw config is parsed into a new config structure without error.]
test_config.py::TestConfig::test_legacy_config_migration[A legacy raw config, with a test_strictness_level defined, is parsed into a new config structure without error.]
/Users/ameya/Workspace/airbyte/airbyte-integrations/bases/connector-acceptance-test/connector_acceptance_test/config.py:285: DeprecationWarning: The 'warn' function is deprecated, use 'warning' instead
logging.warn("The acceptance-test-config.yml file is in a legacy format. Please migrate to the latest format.")
-- Docs: <https://docs.pytest.org/en/stable/warnings.html>
=========================== short test summary info ============================
FAILED unit_tests/test_utils.py::test_docker_runner[standard] - requests.exce...
FAILED unit_tests/test_utils.py::test_docker_runner[waiting] - requests.excep...
FAILED unit_tests/test_utils.py::test_not_found_container - requests.exceptio...
Results (624.33s (0:10:24)):
543 passed
3 failed
- test_utils.py:268 test_docker_runner[standard]
- test_utils.py:268 test_docker_runner[waiting]
- test_utils.py:308 test_not_found_container
/Users/ameya/Workspace/airbyte/airbyte-integrations/bases/connector-acceptance-test/.venv/lib/python3.9/site-packages/coverage/control.py:788: CoverageWarning: No data was collected. (no-data-collected)
self._warn("No data was collected.", slug="no-data-collected")
> Task :airbyte-integrations:bases:connector-acceptance-test:_unitTestCoverage FAILEDkapa.ai
07/04/2023, 12:03 PMkapa.ai
07/04/2023, 12:04 PMhigh test strictness level, the basic_read test is run on a configured catalog created from the discovered catalog from which declared empty streams are removed. If you have declared configured_catalog_path in the test configuration, it could lead to test failures as it's not allowed ([source](https://docs.airbyte.com/connector-development/testing-connectors/connector-acceptance-tests-reference)). If you're facing issues with the Gradle build, it could be due to various reasons such as incorrect Java version, issues with the environment setup, etc. One user faced a similar issue and was able to resolve it by setting the JAVA_HOME environment to point to the JDK folder ([source](https://docs.airbyte.com/contributing-to-airbyte/developing-locally)). If the issue persists, I would recommend reaching out to the Airbyte community on their [Slack channel](https://airbytehq.slack.com) or [forum](https://discuss.airbyte.io) for more specific guidance.Ameya Bapat
07/04/2023, 12:06 PMAmeya Bapat
07/04/2023, 12:06 PMkapa.ai
07/04/2023, 12:06 PMkapa.ai
07/04/2023, 12:06 PMAmeya Bapat
07/04/2023, 1:17 PMkapa.ai
07/04/2023, 1:17 PMkapa.ai
07/04/2023, 1:17 PMLuis Vicente
07/05/2023, 8:45 AMAmeya Bapat
07/05/2023, 8:48 AMAmeya Bapat
07/05/2023, 8:48 AMLuis Vicente
07/05/2023, 8:59 AMLuis Vicente
07/05/2023, 8:59 AMAmeya Bapat
07/05/2023, 9:03 AMLuis Vicente
07/05/2023, 9:04 AMAmeya Bapat
07/05/2023, 9:06 AMLuis Vicente
07/05/2023, 9:23 AM./gradlew :airbyte-integrations:connectors:source-kafka:test worked for meLuis Vicente
07/05/2023, 9:23 AMAmeya Bapat
07/05/2023, 9:24 AMSUB_BUILD=PLATFORM ./gradlew buildAmeya Bapat
07/05/2023, 9:24 AMLuis Vicente
07/05/2023, 9:25 AMAmeya Bapat
07/05/2023, 9:27 AMLuis Vicente
07/05/2023, 9:28 AMAmeya Bapat
07/05/2023, 9:34 AM